Target
Sodium-dependent noradrenaline transporter
Ligand
BDBM388491
Substrate
Meas. Tech.
Uptake Assay Protocol
Ki
2.20±n/a nM
Citation
 Richelson, EFauq, AHCarlier, PMonceaux, CJ Inhibiting neurotransmitter reuptake US Patent  US9944618 Publication Date 4/17/2018 
Target
Name:
Sodium-dependent noradrenaline transporter
Synonyms:
Monoamine transporter NET Noradrenaline Transporter (NET) Norepinephrine transporter protein (NET) SLC6A2 Sodium-dependent noradrenaline transporter (NET) | Solute carrier family 6 member 2
Type:
Multi-pass membrane protein
Mol. Mass.:
69337.72
Organism:
Homo sapiens (Human)
Description:
P23975
Residue:
617
  
Inhibitor
Name:
BDBM388491
Synonyms:
US9944618, Compound ID No. 25
Type:
Small organic molecule
Emp. Form.:
C21H23NO
Mol. Mass.:
305.4134
SMILES:
CNCC([C@H](CO)c1ccccc1)c1ccc2ccccc2c1
: