Target
Sodium-dependent serotonin transporter
Ligand
BDBM388492
Substrate
Meas. Tech.
Uptake Assay Protocol
Ki
1.60±n/a nM
Citation
 Richelson, EFauq, AHCarlier, PMonceaux, CJ Inhibiting neurotransmitter reuptake US Patent  US9944618 Publication Date 4/17/2018 
Target
Name:
Sodium-dependent serotonin transporter
Synonyms:
5-HT Transporter 5HTT SC6A4_HUMAN SLC6A4 Serotonin transporter (5HTT) Sodium-dependent serotonin transporter (SERT) | Solute carrier family 6 member 4
Type:
Multi-pass membrane protein
Mol. Mass.:
70322.51
Organism:
Homo sapiens (Human)
Description:
P31645
Residue:
630
  
Inhibitor
Name:
BDBM388492
Synonyms:
US9944618, Compound ID No. 26
Type:
Small organic molecule
Emp. Form.:
C19H19ClN2O
Mol. Mass.:
326.82
SMILES:
CNC[C@@H]([C@H](O)c1ccc(Cl)nc1)c1ccc2ccccc2c1
: