Target
Sodium-dependent dopamine transporter
Ligand
BDBM86748
Substrate
Meas. Tech.
Uptake Assay Protocol
Ki
3726±n/a nM
Citation
 Richelson, EFauq, AHCarlier, PMonceaux, CJ Inhibiting neurotransmitter reuptake US Patent  US9944618 Publication Date 4/17/2018 
Target
Name:
Sodium-dependent dopamine transporter
Synonyms:
DA transporter DAT1 Dopamine transporter protein (DAT) SC6A3_HUMAN Sodium-dependent dopamine transporter Solute carrier family 6 member 3
Type:
Multi-pass membrane protein
Mol. Mass.:
68497.11
Organism:
Homo sapiens (Human)
Description:
Q01959
Residue:
620
  
Inhibitor
Name:
BDBM86748
Synonyms:
CAS_386750-22-7 NSC_6918664 US9944618, Compound ID No. 181
Type:
Small organic molecule
Emp. Form.:
C16H25NO2
Mol. Mass.:
263.3752
SMILES:
CN(C)CC(c1ccc(O)cc1)C1(O)CCCCC1
: