Target
Acidic mammalian chitinase
Ligand
BDBM349918
Substrate
Meas. Tech.
Human AMCase Activity Assay
IC50
550±n/a nM
Citation
 Mazur, MKoralewski, RBorek, BOlejniczak, SCzestkowski, WJPiotrowicz, MCOlczak, JPGolebiowski, AABartoszewicz, AMaziarz, EKowalski, M Substituted amino triazoles useful as human chitinase inhibitors US Patent  US9944624 Publication Date 4/17/2018 
Target
Name:
Acidic mammalian chitinase
Synonyms:
AMCase CHIA Lung-specific protein TSA1902
Type:
Protein
Mol. Mass.:
52266.66
Organism:
Homo sapiens (Human)
Description:
Q9BZP6
Residue:
476
  
Inhibitor
Name:
BDBM349918
Synonyms:
(2S,5S)-4-(1-(5-amino-4H-1,2,4-triazol-3-yl)piperidin-4-yl)-5-(4-chlorobenzyl)morpholine-2-carboxamide US10538508, Example 8 | US9944624, Ex. 8
Type:
Small organic molecule
Emp. Form.:
C19H26ClN7O2
Mol. Mass.:
419.908
SMILES:
NC(=O)[C@@H]1CN(C(Cc2ccc(Cl)cc2)CO1)C1CCN(CC1)c1nnc(N)[nH]1
: