Target
Acidic mammalian chitinase
Ligand
BDBM349927
Substrate
Meas. Tech.
Human AMCase Activity Assay
IC50
<100±n/a nM
Citation
 Mazur, MKoralewski, RBorek, BOlejniczak, SCzestkowski, WJPiotrowicz, MCOlczak, JPGolebiowski, AABartoszewicz, AMaziarz, EKowalski, M Substituted amino triazoles useful as human chitinase inhibitors US Patent  US9944624 Publication Date 4/17/2018 
Target
Name:
Acidic mammalian chitinase
Synonyms:
AMCase CHIA Lung-specific protein TSA1902
Type:
Protein
Mol. Mass.:
52266.66
Organism:
Homo sapiens (Human)
Description:
Q9BZP6
Residue:
476
  
Inhibitor
Name:
BDBM349927
Synonyms:
(6R)-1′-(5-amino-4H-1,2,4-triazol-3-yl)-6-(4-chlorobenzyl)-[1,4′-bipiperidine]-3-carboxylic acid US10538508, Example 17 | US9944624, Ex. 17
Type:
Small organic molecule
Emp. Form.:
C20H27ClN6O2
Mol. Mass.:
418.92
SMILES:
Nc1nnc([nH]1)N1CCC(CC1)N1CC(CCC1Cc1ccc(Cl)cc1)C(O)=O
: