Target
Chitotriosidase-1
Ligand
BDBM349935
Substrate
Meas. Tech.
Human CHIT1 Activity Assay
IC50
5500±n/a nM
Citation
 Mazur, MKoralewski, RBorek, BOlejniczak, SCzestkowski, WJPiotrowicz, MCOlczak, JPGolebiowski, AABartoszewicz, AMaziarz, EKowalski, M Substituted amino triazoles useful as human chitinase inhibitors US Patent  US9944624 Publication Date 4/17/2018 
Target
Name:
Chitotriosidase-1
Synonyms:
CHIT1 Chitinase 1 Chitotriosidase Chitotriosidase-1 (CHIT1)
Type:
Enzyme
Mol. Mass.:
51682.25
Organism:
Homo sapiens (Human)
Description:
Q13231
Residue:
466
  
Inhibitor
Name:
BDBM349935
Synonyms:
(S)-4-(1-(5-amino-4H-1,2,4-triazol-3-yl)piperidin-4-yl)-5-(4-chlorobenzyl)piperazin-2-one US10538508, Example 25 | US9944624, Ex. 25
Type:
Small organic molecule
Emp. Form.:
C18H24ClN7O
Mol. Mass.:
389.882
SMILES:
Nc1nnc([nH]1)N1CCC(CC1)N1CC(=O)NCC1Cc1ccc(Cl)cc1
: