Target
Acidic mammalian chitinase
Ligand
BDBM388671
Substrate
Meas. Tech.
Human AMCase Activity Assay
IC50
<100±n/a nM
Citation
 Mazur, MKoralewski, RBorek, BOlejniczak, SCzestkowski, WJPiotrowicz, MCOlczak, JPGolebiowski, AABartoszewicz, AMaziarz, EKowalski, M Substituted amino triazoles useful as human chitinase inhibitors US Patent  US9944624 Publication Date 4/17/2018 
Target
Name:
Acidic mammalian chitinase
Synonyms:
AMCase CHIA Lung-specific protein TSA1902
Type:
Protein
Mol. Mass.:
52266.66
Organism:
Homo sapiens (Human)
Description:
Q9BZP6
Residue:
476
  
Inhibitor
Name:
BDBM388671
Synonyms:
5-(4-((2S,5S)-2-(4-chlorobenzyl)-5-isobutyl-4-methylpiperazin-1-yl)piperidin-1-yl)-4H-1,2,4-triazol-3-amine US9944624, Ex. 33
Type:
Small organic molecule
Emp. Form.:
C23H36ClN7
Mol. Mass.:
446.032
SMILES:
CC(C)C[C@H]1CN(C(Cc2ccc(Cl)cc2)CN1C)C1CCN(CC1)c1nnc(N)[nH]1
: