Target
Acidic mammalian chitinase
Ligand
BDBM349966
Substrate
Meas. Tech.
Human AMCase Activity Assay
IC50
5500±n/a nM
Citation
 Mazur, MKoralewski, RBorek, BOlejniczak, SCzestkowski, WJPiotrowicz, MCOlczak, JPGolebiowski, AABartoszewicz, AMaziarz, EKowalski, M Substituted amino triazoles useful as human chitinase inhibitors US Patent  US9944624 Publication Date 4/17/2018 
Target
Name:
Acidic mammalian chitinase
Synonyms:
AMCase CHIA Lung-specific protein TSA1902
Type:
Protein
Mol. Mass.:
52266.66
Organism:
Homo sapiens (Human)
Description:
Q9BZP6
Residue:
476
  
Inhibitor
Name:
BDBM349966
Synonyms:
(S)-5-(4-(2-(4-chlorobenzyl)-4-methyl-1,4-diazepan-1-yl)piperidin-1-yl)-4H-1,2,4-triazol-3-amine US10538508, Example 56 | US9944624, Ex. 56
Type:
Small organic molecule
Emp. Form.:
C20H30ClN7
Mol. Mass.:
403.952
SMILES:
CN1CCCN(C2CCN(CC2)c2nnc(N)[nH]2)[C@@H](Cc2ccc(Cl)cc2)C1
: