Target
Acidic mammalian chitinase
Ligand
BDBM349972
Substrate
Meas. Tech.
Human AMCase Activity Assay
IC50
<100±n/a nM
Citation
 Mazur, MKoralewski, RBorek, BOlejniczak, SCzestkowski, WJPiotrowicz, MCOlczak, JPGolebiowski, AABartoszewicz, AMaziarz, EKowalski, M Substituted amino triazoles useful as human chitinase inhibitors US Patent  US9944624 Publication Date 4/17/2018 
Target
Name:
Acidic mammalian chitinase
Synonyms:
AMCase CHIA Lung-specific protein TSA1902
Type:
Protein
Mol. Mass.:
52266.66
Organism:
Homo sapiens (Human)
Description:
Q9BZP6
Residue:
476
  
Inhibitor
Name:
BDBM349972
Synonyms:
(S)-5-(4-(7,9-dichloro-3-(4-chlorobenzyl)-2,3-dihydrobenzo[f][1,4]oxazepin-4(5H)-yl)piperidin-1-yl)-4H-1,2,4-triazol-3-amine US10538508, Example 62 US9944624, Ex. 62
Type:
Small organic molecule
Emp. Form.:
C23H25Cl3N6O
Mol. Mass.:
507.843
SMILES:
Nc1nnc([nH]1)N1CCC(CC1)N1Cc2cc(Cl)cc(Cl)c2OC[C@@H]1Cc1ccc(Cl)cc1
: