Target
Probable G-protein coupled receptor 139
Ligand
BDBM263485
Substrate
Meas. Tech.
Competition Binding
pH
7.4±n/a
Temperature
277.15±n/a K
Ki
171±n/a nM
Comments
extracted
Citation
 Hitchcock, SLam, BMonenschein, HReichard, H 4-oxo-3,4-dihydro-1,2,3-benzotriazine modulators of GPR139 US Patent  US9556130 Publication Date 1/31/2017 
Target
Name:
Probable G-protein coupled receptor 139
Synonyms:
G(q)-coupled orphan receptor GPRg1 G-protein-coupled receptor PGR3 GPR139 GPRG1 Probable G-protein coupled receptor 139
Type:
PROTEIN
Mol. Mass.:
40700.34
Organism:
Homo sapiens (Human)
Description:
ChEMBL_109920
Residue:
353
  
Inhibitor
Name:
BDBM263485
Synonyms:
(s)?n-(1-(2-fluoro-4-methylphenyl)ethyl)-2-(4-oxobenzo[d][1,2,3]triazin-3 (4h)-yl)acetamide US11173161, EX 53 | US9556130, test 53
Type:
Small organic molecule
Emp. Form.:
C18H17FN4O2
Mol. Mass.:
340.3516
SMILES:
C[C@H](NC(=O)Cn1nnc2ccccc2c1=O)c1ccc(C)cc1F
: