Target
Hepatocyte growth factor receptor
Ligand
BDBM388708
Substrate
Meas. Tech.
In Vitro c-Met Kinase Enzyme Assay
IC50
<500±n/a nM
Citation
 Zhuo, JXu, MHe, CZhang, CQian, DBurns, DMLi, YMetcalf, BYao, W Imidazotriazines and imidazopyrimidines as kinase inhibitors US Patent  US9944645 Publication Date 4/17/2018 
Target
Name:
Hepatocyte growth factor receptor
Synonyms:
Hepatocyte growth factor receptor Hepatocyte growth factor receptor (c-MET) MET Met proto-oncogene (hepatocyte growth factor receptor) Tyrosine-protein kinase Met (c-Met) c-Met kinase
Type:
Protein
Mol. Mass.:
155559.73
Organism:
Homo sapiens (Human)
Description:
P08581
Residue:
1390
  
Inhibitor
Name:
BDBM388708
Synonyms:
6-[1-(6-{4-[(3-Pyridin-2-ylpyrrolidin-1-yl)carbonyl]phenyl}imidazo[1,2-a]pyrimidin-3-yl)cyclopropyl]quinoline US11261191, Example 38 | US9944645, 38
Type:
Small organic molecule
Emp. Form.:
C34H28N6O
Mol. Mass.:
536.6257
SMILES:
O=C(N1CCC(C1)c1ccccn1)c1ccc(cc1)-c1cnc2ncc(n2c1)C1(CC1)c1ccc2ncccc2c1
: