Target
Hepatocyte growth factor receptor
Ligand
BDBM388770
Substrate
Meas. Tech.
In Vitro c-Met Kinase Enzyme Assay
IC50
<500±n/a nM
Citation
 Zhuo, JXu, MHe, CZhang, CQian, DBurns, DMLi, YMetcalf, BYao, W Imidazotriazines and imidazopyrimidines as kinase inhibitors US Patent  US9944645 Publication Date 4/17/2018 
Target
Name:
Hepatocyte growth factor receptor
Synonyms:
Hepatocyte growth factor receptor Hepatocyte growth factor receptor (c-MET) MET Met proto-oncogene (hepatocyte growth factor receptor) Tyrosine-protein kinase Met (c-Met) c-Met kinase
Type:
Protein
Mol. Mass.:
155559.73
Organism:
Homo sapiens (Human)
Description:
P08581
Residue:
1390
  
Inhibitor
Name:
BDBM388770
Synonyms:
2-Fluoro-N-(trans-4-hydroxycyclohexyl)-4-[7-(1-quinolin-6-ylcyclopropyl)imidazo[1,2-b][1,2,4]triazin-2-yl]benzamide US11261191, Example 100 | US9944645, 100
Type:
Small organic molecule
Emp. Form.:
C30H27FN6O2
Mol. Mass.:
522.5728
SMILES:
O[C@H]1CC[C@@H](CC1)NC(=O)c1ccc(cc1F)-c1cnc2ncc(n2n1)C1(CC1)c1ccc2ncccc2c1
: