Target
Phosphatidylinositol 4,5-bisphosphate 3-kinase catalytic subunit delta isoform
Ligand
BDBM377086
Substrate
Meas. Tech.
Scintillation Proximity Assay
IC50
<100±n/a nM
Citation
 Combs, APSparks, RBMaduskuie, Jr., TP Bicyclic azaheterocyclobenzylamines as PI3K inhibitors US Patent  US9944646 Publication Date 4/17/2018 
Target
Name:
Phosphatidylinositol 4,5-bisphosphate 3-kinase catalytic subunit delta isoform
Synonyms:
PI3-kinase p110 subunit delta PI3-kinase subunit p110-delta PIK3CD Phosphatidylinositol 4,5-biphosphate 3-kinase catalytic subunit delta (PIK3CD) Phosphatidylinositol 4,5-bisphosphate 3-kinase 110 kDa catalytic subunit delta (PI3K delta) Phosphatidylinositol 4,5-bisphosphate 3-kinase catalytic subunit delta (PI3Kdelta) Phosphatidylinositol 4,5-bisphosphate 3-kinase catalytic subunit delta isoform (PI3K delta) Phosphatidylinositol 4,5-bisphosphate 3-kinase catalytic subunit delta isoform (PI3K-delta) Phosphatidylinositol 4,5-bisphosphate 3-kinase catalytic subunit delta isoform (PI3Kdelta)
Type:
Enzyme Subunit
Mol. Mass.:
119489.41
Organism:
Homo sapiens (Human)
Description:
O00329
Residue:
1044
  
Inhibitor
Name:
BDBM377086
Synonyms:
US10259818, Example 68 | US9944646, Example 67
Type:
Small organic molecule
Emp. Form.:
C25H29ClN8O2
Mol. Mass.:
509.003
SMILES:
CC(c1cc(Cl)c(C#N)c2CN(C[C@@H](C)Oc12)C1CC(C1)NC(C)=O)n1nc(C)c2c(N)ncnc12
: