Target
Phosphatidylinositol 4,5-bisphosphate 3-kinase catalytic subunit delta isoform
Ligand
BDBM377091
Substrate
Meas. Tech.
Scintillation Proximity Assay
IC50
<100±n/a nM
Citation
 Combs, APSparks, RBMaduskuie, Jr., TP Bicyclic azaheterocyclobenzylamines as PI3K inhibitors US Patent  US9944646 Publication Date 4/17/2018 
Target
Name:
Phosphatidylinositol 4,5-bisphosphate 3-kinase catalytic subunit delta isoform
Synonyms:
PI3-kinase p110 subunit delta PI3-kinase subunit p110-delta PIK3CD Phosphatidylinositol 4,5-biphosphate 3-kinase catalytic subunit delta (PIK3CD) Phosphatidylinositol 4,5-bisphosphate 3-kinase 110 kDa catalytic subunit delta (PI3K delta) Phosphatidylinositol 4,5-bisphosphate 3-kinase catalytic subunit delta (PI3Kdelta) Phosphatidylinositol 4,5-bisphosphate 3-kinase catalytic subunit delta isoform (PI3K delta) Phosphatidylinositol 4,5-bisphosphate 3-kinase catalytic subunit delta isoform (PI3K-delta) Phosphatidylinositol 4,5-bisphosphate 3-kinase catalytic subunit delta isoform (PI3Kdelta)
Type:
Enzyme Subunit
Mol. Mass.:
119489.41
Organism:
Homo sapiens (Human)
Description:
O00329
Residue:
1044
  
Inhibitor
Name:
BDBM377091
Synonyms:
3-[9-[1-(4-amino-3-methyl- 1H-pyrazolo[3,4- d]pyrimidin-1-yl)ethyl]-7- chloro-6-fluoro-2,3- dihydro-1,4-benzoxazepin- 4(5H)-yl]-N,N- dimethylazetidine-1- sulfonamide US9944646, Example 74
Type:
Small organic molecule
Emp. Form.:
C22H28ClFN8O3S
Mol. Mass.:
539.026
SMILES:
CC(c1cc(Cl)c(F)c2CN(CCOc12)C1CN(C1)S(=O)(=O)N(C)C)n1nc(C)c2c(N)ncnc12
: