Target
Lysine-specific histone demethylase 1A
Ligand
BDBM388910
Substrate
Meas. Tech.
Biochemical Assay
IC50
<50±n/a nM
Citation
 He, CLi, ZWu, LYao, WZhang, F Heterocyclic compounds as LSD1 inhibitors US Patent  US9944647 Publication Date 4/17/2018 
Target
Name:
Lysine-specific histone demethylase 1A
Synonyms:
AOF2 Flavin-containing amine oxidase domain-containing protein 2 KDM1A KIAA0601 Lysine-specific demethylase 1 (LSD1) Lysine-specific histone demethylase 1 (LSD1)
Type:
Enzyme
Mol. Mass.:
92901.01
Organism:
Homo sapiens (Human)
Description:
O60341
Residue:
852
  
Inhibitor
Name:
BDBM388910
Synonyms:
4-(8-[3-fluoro-4-(hydroxymethyl)phenyl]-5-{[(3R)-1-methylpiperidin-3-yl]methoxy}imidazo[1,2-c]pyrimidin-7-yl)benzonitrile US11401272, Example 31 | US9944647, Example 31
Type:
Small organic molecule
Emp. Form.:
C27H26FN5O2
Mol. Mass.:
471.526
SMILES:
CN1CCC[C@@H](COc2nc(-c3ccc(cc3)C#N)c(-c3ccc(CO)c(F)c3)c3nccn23)C1
: