Target
Lysine-specific histone demethylase 1A
Ligand
BDBM388989
Substrate
Meas. Tech.
Biochemical Assay
IC50
<50±n/a nM
Citation
 He, CLi, ZWu, LYao, WZhang, F Heterocyclic compounds as LSD1 inhibitors US Patent  US9944647 Publication Date 4/17/2018 
Target
Name:
Lysine-specific histone demethylase 1A
Synonyms:
AOF2 Flavin-containing amine oxidase domain-containing protein 2 KDM1A KIAA0601 Lysine-specific demethylase 1 (LSD1) Lysine-specific histone demethylase 1 (LSD1)
Type:
Enzyme
Mol. Mass.:
92901.01
Organism:
Homo sapiens (Human)
Description:
O60341
Residue:
852
  
Inhibitor
Name:
BDBM388989
Synonyms:
4-{5-[4-(dimethylamino)piperidin-1- yl]-8-[3-fluoro-4-(morpholin-4- ylmethyl)phenyl]imidazo[1,2- c]pyrimidin-7-yl}benzonitrile US11401272, Example 98 | US9944647, Example 98
Type:
Small organic molecule
Emp. Form.:
C31H34FN7O
Mol. Mass.:
539.6464
SMILES:
CN(C)C1CCN(CC1)c1nc(-c2ccc(cc2)C#N)c(-c2ccc(CN3CCOCC3)c(F)c2)c2nccn12
: