Target
Lysine-specific histone demethylase 1A
Ligand
BDBM389007
Substrate
Meas. Tech.
Biochemical Assay
IC50
<50±n/a nM
Citation
 He, CLi, ZWu, LYao, WZhang, F Heterocyclic compounds as LSD1 inhibitors US Patent  US9944647 Publication Date 4/17/2018 
Target
Name:
Lysine-specific histone demethylase 1A
Synonyms:
AOF2 Flavin-containing amine oxidase domain-containing protein 2 KDM1A KIAA0601 Lysine-specific demethylase 1 (LSD1) Lysine-specific histone demethylase 1 (LSD1)
Type:
Enzyme
Mol. Mass.:
92901.01
Organism:
Homo sapiens (Human)
Description:
O60341
Residue:
852
  
Inhibitor
Name:
BDBM389007
Synonyms:
US10800779, Example 116 US9944647, Example 116 | methyl (4-{7-(4-cyanophenyl)-5-[4- (dimethylamino)piperidin-1- yl]imidazo[1,2-c]pyrimidin-8-yl}-2- fluorophenyl)methylcarbamate
Type:
Small organic molecule
Emp. Form.:
C29H30FN7O2
Mol. Mass.:
527.5926
SMILES:
COC(=O)N(C)c1ccc(cc1F)-c1c(nc(N2CCC(CC2)N(C)C)n2ccnc12)-c1ccc(cc1)C#N
: