Target
cAMP-specific 3',5'-cyclic phosphodiesterase 4D
Ligand
BDBM389051
Substrate
Meas. Tech.
Inhibitory Activity Assay
IC50
<50.0±n/a nM
Citation
 Okada, MKato, MSato, NUno, TKitagaki, HHaruta, JHiyama, HShibata, T Oxazole compound and pharmaceutical composition US Patent  USRE46792 Publication Date 4/17/2018 
Target
Name:
cAMP-specific 3',5'-cyclic phosphodiesterase 4D
Synonyms:
3',5'-cyclic phosphodiesterase PDE43 PDE4D_HUMAN | Phosphodiesterase 4D
Type:
Protein
Mol. Mass.:
91092.69
Organism:
Homo sapiens (Human)
Description:
Q08499
Residue:
809
  
Inhibitor
Name:
BDBM389051
Synonyms:
USRE46792, 104
Type:
Small organic molecule
Emp. Form.:
C24H25NO5
Mol. Mass.:
407.459
SMILES:
CCOc1ccccc1C(=O)CCc1coc(n1)-c1ccc(OC)c(OCC=C)c1
: