Target
cAMP-specific 3',5'-cyclic phosphodiesterase 4D
Ligand
BDBM389058
Substrate
Meas. Tech.
Inhibitory Activity Assay
IC50
<50.0±n/a nM
Citation
 Okada, MKato, MSato, NUno, TKitagaki, HHaruta, JHiyama, HShibata, T Oxazole compound and pharmaceutical composition US Patent  USRE46792 Publication Date 4/17/2018 
Target
Name:
cAMP-specific 3',5'-cyclic phosphodiesterase 4D
Synonyms:
3',5'-cyclic phosphodiesterase PDE43 PDE4D_HUMAN | Phosphodiesterase 4D
Type:
Protein
Mol. Mass.:
91092.69
Organism:
Homo sapiens (Human)
Description:
Q08499
Residue:
809
  
Inhibitor
Name:
BDBM389058
Synonyms:
USRE46792, 132
Type:
Small organic molecule
Emp. Form.:
C25H28N2O5
Mol. Mass.:
436.5002
SMILES:
CCOc1cccnc1C(=O)CCc1coc(n1)-c1ccc(OC)c(OC2CCCC2)c1
: