Target
Indoleamine 2,3-dioxygenase 1
Ligand
BDBM312071
Substrate
Meas. Tech.
Enzymatic Activity Assay
IC50
>50000±n/a nM
Citation
 Crosignani, SCauwenberghs, SDriessens, GDeroose, F Pyrrolidine-2, 5-dione derivatives, pharmaceutical compositions and methods for use as IDO1 inhibitors US Patent  US9949951 Publication Date 4/24/2018 
Target
Name:
Indoleamine 2,3-dioxygenase 1
Synonyms:
I23O1_HUMAN IDO-1 INDO Indoleamine 2,3-dioxygenase | Indoleamine-pyrrole 2,3-dioxygenase
Type:
Enzyme
Mol. Mass.:
45330.80
Organism:
Homo sapiens (Human)
Description:
P14902
Residue:
403
  
Inhibitor
Name:
BDBM312071
Synonyms:
US9603836, Compound 6a | US9949951, 6a
Type:
Small organic molecule
Emp. Form.:
C12H9ClN2O2
Mol. Mass.:
248.665
SMILES:
Clc1ccc2[nH]cc([C@@H]3CC(=O)NC3=O)c2c1
: