Target
Genome polyprotein
Ligand
BDBM27007
Substrate
NS3-NS4A Chromogenic Peptide Substrate
Meas. Tech.
Continuous Spectrophotometric Assay
pH
6.5±n/a
Temperature
303.15±n/a K
Ki
36±n/a nM
Citation
 Venkatraman, SVelazquez, FWu, WBlackman, MChen, KXBogen, SNair, LTong, XChase, RHart, AAgrawal, SPichardo, JProngay, ACheng, KCGirijavallabhan, VPiwinski, JShih, NYNjoroge, FG Discovery and structure-activity relationship of P1-P3 ketoamide derived macrocyclic inhibitors of hepatitis C virus NS3 protease. J Med Chem 52:336-46 (2009)  
Target
Name:
Genome polyprotein
Synonyms:
Dipeptidyl peptidase 4 (DPP4) NS3 NS5B NS3-4A Protease NS3/4A protease POLG_HCV77 | RNA polymerase (NS5B)
Type:
Protease Domain
Mol. Mass.:
327221.49
Organism:
Hepatitis C virus (HCV genotype 1a, isolate H)
Description:
P27958
Residue:
3011
  
Inhibitor
Name:
BDBM27007
Synonyms:
2-[(3S,14S,17S,18R,20S)-19,19-dimethyl-3-{[(1-methylcyclohexyl)carbamoyl]amino}-2,16-dioxo-1,15-diazatricyclo[15.4.0.0^{18,20}]henicosan-14-yl]-2-oxoacetamide | ketoamide derived macrocyclic inhibitor, 31
Type:
Small organic molecule
Emp. Form.:
C31H51N5O5
Mol. Mass.:
573.7671
SMILES:
CC1(C)[C@H]2CN3[C@@H]([C@@H]12)C(=O)N[C@@H](CCCCCCCCCC[C@H](NC(=O)NC1(C)CCCCC1)C3=O)C(=O)C(N)=O
:
Substrate
Name:
NS3-NS4A Chromogenic Peptide Substrate
Synonyms:
Type:
Peptide
Mol. Mass.:
1366.94
Organism:
Description:
The 4-phenylazophenol (PAP) chromophore was incorporated to improve assay sensitivity.
Residue:
13
ACDTEDVVPNVAH