Target
Tyrosine-protein kinase BTK
Ligand
BDBM263517
Substrate
Meas. Tech.
TR-FRET (Time Resolved FRET) Assay
pH
7.15±n/a
IC50
2.30±0 nM
Comments
extracted
Citation
 Lopez-Tapia, FJKong, NSo, SLou, YDominique, R Inhibitors of bruton's tyrosine kinase US Patent  US9556150 Publication Date 1/31/2017 
Target
Name:
Tyrosine-protein kinase BTK
Synonyms:
AGMX1 Agammaglobulinaemia tyrosine kinase B cell progenitor kinase BPK BTK_HUMAN Tyrosine Kinase BTK Tyrosine-protein kinase BTK (BTK)
Type:
Enzyme
Mol. Mass.:
76289.95
Organism:
Homo sapiens (Human)
Description:
Q06187
Residue:
659
  
Inhibitor
Name:
BDBM263517
Synonyms:
US9556150, i-5 | {5-amino-1-[4-(2,3-difluoro- phenoxy)-2-methyl-phenyl]-1h- pyrazole-4-carbonyl}-1h-indol- 5-yl)-morpholin-4-yl-methanone
Type:
Small organic molecule
Emp. Form.:
C30H25F2N5O4
Mol. Mass.:
557.5474
SMILES:
Cc1cc(Oc2cccc(F)c2F)ccc1-n1ncc(C(=O)c2cc3cc(ccc3[nH]2)C(=O)N2CCOCC2)c1N
: