Target
Beta-secretase 1
Ligand
BDBM150715
Substrate
Meas. Tech.
Inhibitory Activity Assay
IC50
8.00±n/a nM
Citation
 Bukhtiyarov, YCacatian, SDillard, LWDorner-Ciossek, CFuchs, KJia, LLala, DSMorales-Ramos, AReeves, JSingh, SBVenkatraman, SXu, ZYuan, JZhao, YZheng, YRast, G Inhibitors of beta-secretase US Patent  US9949975 Publication Date 4/24/2018 
Target
Name:
Beta-secretase 1
Synonyms:
ASP2 Aspartyl protease 2 BACE1 Beta-secretase (BACE) Beta-secretase 1 (BACE 1) Beta-secretase 1 (BACE1) Beta-site amyloid precursor protein cleaving enzyme 1 Memapsin-2 beta-Secretase (BACE-1) | beta-Secretase (BACE1)
Type:
Protein
Mol. Mass.:
55755.10
Organism:
Homo sapiens (Human)
Description:
P56817
Residue:
501
  
Inhibitor
Name:
BDBM150715
Synonyms:
US8981112, 22 US9949975, Example 22
Type:
Small organic molecule
Emp. Form.:
C25H32N4O4
Mol. Mass.:
452.546
SMILES:
CO[C@@H]1[C@@H](C)C[C@]2(Cc3ccc(cc3[C@]22N=C(N)N(C[C@H]3COCCO3)C2=O)C#N)C[C@H]1C
: