Target
Genome polyprotein
Ligand
BDBM27062
Substrate
NS3-NS4A Chromogenic Peptide Substrate
Meas. Tech.
Continuous Spectrophotometric Assay
pH
6.5±n/a
Temperature
303.15±n/a K
Ki
15±n/a nM
Citation
 Velázquez, FVenkatraman, SBlackman, MPinto, PBogen, SSannigrahi, MChen, KPichardo, JHart, ATong, XGirijavallabhan, VNjoroge, FG Design, synthesis, and evaluation of oxygen-containing macrocyclic peptidomimetics as inhibitors of HCV NS3 protease. J Med Chem 52:700-8 (2009)  
Target
Name:
Genome polyprotein
Synonyms:
Dipeptidyl peptidase 4 (DPP4) NS3 NS5B NS3-4A Protease NS3/4A protease POLG_HCV77 | RNA polymerase (NS5B)
Type:
Protease Domain
Mol. Mass.:
327221.49
Organism:
Hepatitis C virus (HCV genotype 1a, isolate H)
Description:
P27958
Residue:
3011
  
Inhibitor
Name:
BDBM27062
Synonyms:
2-[(3S,13S,16S,17R,19S)-3-({[(2S)-3,3-dimethyl-1-(4-methyl-2,6-dioxopiperazin-1-yl)butan-2-yl]carbamoyl}amino)-18,18-dimethyl-2,15-dioxo-5-oxa-1,14-diazatricyclo[14.4.0.0^{17,19}]icosan-13-yl]-2-oxo-N-(prop-2-en-1-yl)acetamide | Macrocyclic Peptidomimetic, 30
Type:
Small organic molecule
Emp. Form.:
C36H57N7O8
Mol. Mass.:
715.8799
SMILES:
CN1CC(=O)N(C[C@@H](NC(=O)N[C@H]2COCCCCCCC[C@H](NC(=O)[C@@H]3[C@@H]4[C@H](CN3C2=O)C4(C)C)C(=O)C(=O)NCC=C)C(C)(C)C)C(=O)C1
:
Substrate
Name:
NS3-NS4A Chromogenic Peptide Substrate
Synonyms:
Type:
Peptide
Mol. Mass.:
1366.94
Organism:
Description:
The 4-phenylazophenol (PAP) chromophore was incorporated to improve assay sensitivity.
Residue:
13
ACDTEDVVPNVAH