Target
Genome polyprotein
Ligand
BDBM27074
Substrate
NS3-NS4A Chromogenic Peptide Substrate
Meas. Tech.
Continuous Spectrophotometric Assay
pH
6.5±n/a
Temperature
303.15±n/a K
Ki
10±n/a nM
Citation
 Venkatraman, SWu, WProngay, AGirijavallabhan, VGeorge Njoroge, F Potent inhibitors of HCV-NS3 protease derived from boronic acids. Bioorg Med Chem Lett 19:180-3 (2009)  
Target
Name:
Genome polyprotein
Synonyms:
Dipeptidyl peptidase 4 (DPP4) NS3 NS5B NS3-4A Protease NS3/4A protease POLG_HCV77 | RNA polymerase (NS5B)
Type:
Protease Domain
Mol. Mass.:
327221.49
Organism:
Hepatitis C virus (HCV genotype 1a, isolate H)
Description:
P27958
Residue:
3011
  
Inhibitor
Name:
BDBM27074
Synonyms:
(1R,5S)-3-[(2S)-2-[(tert-butylcarbamoyl)amino]-3,3-dimethylbutanoyl]-N-[(1R)-2-cyclobutyl-1-(dihydroxyboranyl)ethyl]-6,6-dimethyl-3-azabicyclo[3.1.0]hexane-2-carboxamide | boronic acid derivative, 15
Type:
Small organic molecule
Emp. Form.:
C25H45BN4O5
Mol. Mass.:
492.46
SMILES:
CC(C)(C)NC(=O)N[C@H](C(=O)N1C[C@H]2[C@@H](C1C(=O)N[C@@H](CC1CCC1)B(O)O)C2(C)C)C(C)(C)C
:
Substrate
Name:
NS3-NS4A Chromogenic Peptide Substrate
Synonyms:
Type:
Peptide
Mol. Mass.:
1366.94
Organism:
Description:
The 4-phenylazophenol (PAP) chromophore was incorporated to improve assay sensitivity.
Residue:
13
ACDTEDVVPNVAH