Target
Cyclin-A2/Cyclin-dependent kinase 2
Ligand
BDBM27084
Substrate
Histone H1
IC50
1200±n/a nM
Citation
 Howard, SBerdini, VBoulstridge, JACarr, MGCross, DMCurry, JDevine, LAEarly, TRFazal, LGill, ALHeathcote, MMaman, SMatthews, JEMcMenamin, RLNavarro, EFO'Brien, MAO'Reilly, MRees, DCReule, MTisi, DWilliams, GVinković, MWyatt, PG Fragment-based discovery of the pyrazol-4-yl urea (AT9283), a multitargeted kinase inhibitor with potent aurora kinase activity. J Med Chem 52:379-88 (2009)  
Target
Name:
Cyclin-A2/Cyclin-dependent kinase 2
Synonyms:
CDK2-CyclinA CDK2/Cyclin A Cyclin A2/dependent kinase 2 Cyclin-Dependent Kinase 2 (CDK2A)
Type:
Protein Complex
Mol. Mass.:
Description:
Cdk2/Cyclin A kinase was purified from insect cells coinfected with Cyclin A/Cdk2 baculovirus.
Components:
This complex has 2 components.
Component 1
Name:
Cyclin-dependent kinase 2
Synonyms:
CDK2 CDK2_HUMAN Cell division protein kinase 2 Protein cereblon/Cyclin-dependent kinase 2 | p33 protein kinase
Type:
Enzyme Subunit
Mol. Mass.:
33938.17
Organism:
Homo sapiens (Human)
Description:
P24941
Residue:
298
  
Component 2
Name:
Cyclin-A2
Synonyms:
CCN1 CCNA1 CCNA2_HUMAN Cyclin-A
Type:
Enzyme Subunit
Mol. Mass.:
48550.19
Organism:
Homo sapiens (Human)
Description:
P20248
Residue:
432
  
Inhibitor
Name:
BDBM27084
Synonyms:
1-cyclohexyl-3-{3-[5-(morpholin-4-ylmethyl)-1H-1,3-benzodiazol-2-yl]-1H-pyrazol-4-yl}urea | pyrazole-benzimidazole urea analogue, 13
Type:
Small organic molecule
Emp. Form.:
C22H29N7O2
Mol. Mass.:
423.5114
SMILES:
O=C(NC1CCCCC1)Nc1c[nH]nc1-c1nc2ccc(CN3CCOCC3)cc2[nH]1
:
Substrate
Name:
Histone H1
Synonyms:
Type:
Other Protein Type
Mol. Mass.:
358.43
Organism:
Bos taurus (bovine)
Description:
Residue:
3
NA