Target
Nitric oxide synthase, inducible
Ligand
BDBM50093348
Substrate
Meas. Tech.
Inhibition Assay
Ki
5559±421 nM
Citation
 Silverman, RBJing, QKang, SWang, H Mammalian and bacterial nitric oxide synthase inhibitors US Patent  US9951014 Publication Date 4/24/2018 
Target
Name:
Nitric oxide synthase, inducible
Synonyms:
HEP-NOS Inducible NO synthase NOS type II NOS2A Nitric oxide synthase, inducible (iNOS) | iNOS
Type:
Homodimer
Mol. Mass.:
131141.95
Organism:
Homo sapiens (Human)
Description:
P35228
Residue:
1153
  
Inhibitor
Name:
BDBM50093348
Synonyms:
CHEMBL3586663 | US9951014, Name 19b
Type:
Small organic molecule
Emp. Form.:
C18H25FN4
Mol. Mass.:
316.4163
SMILES:
CNCCN(C)c1cc(F)cc(CCc2cc(C)cc(N)n2)c1
: