Target
Nitric oxide synthase, brain
Ligand
BDBM389158
Substrate
Meas. Tech.
Inhibition Assay
Ki
121±n/a nM
Citation
 Silverman, RBJing, QKang, SWang, H Mammalian and bacterial nitric oxide synthase inhibitors US Patent  US9951014 Publication Date 4/24/2018 
Target
Name:
Nitric oxide synthase, brain
Synonyms:
Bnos NC-NOS NOS type I nNOS Neuronal nitric oxide synthase Nitric Oxide Synthase, brain Nitric oxide synthase, brain (nNOS) Nitric-oxide synthase, brain (nNOS) Nos1 | Peptidyl-cysteine S-nitrosylase NOS1
Type:
Enzyme
Mol. Mass.:
160570.98
Organism:
Rattus norvegicus (rat)
Description:
Recombinant nNOS overexpressed in E. coli was used in enzyme assays.
Residue:
1429
  
Inhibitor
Name:
BDBM389158
Synonyms:
US9951014, Name 23i
Type:
Small organic molecule
Emp. Form.:
C19H25FN4
Mol. Mass.:
328.427
SMILES:
Cc1cc(N)nc(CCc2cc(F)cc(NC3CCNCC3)c2)c1
: