Target
Nitric oxide synthase, brain
Ligand
BDBM50014716
Substrate
Meas. Tech.
Inhibition Assay
Ki
70.0±4 nM
Citation
 Silverman, RBJing, QKang, SWang, H Mammalian and bacterial nitric oxide synthase inhibitors US Patent  US9951014 Publication Date 4/24/2018 
Target
Name:
Nitric oxide synthase, brain
Synonyms:
Constitutive NOS NC-NOS NOS type I nNOS NOS1_HUMAN Neuronal nitric oxide synthase Nitric oxide synthase, neuronal (nNOS) bNOS | nNOS
Type:
Homodimer
Mol. Mass.:
160985.98
Organism:
Homo sapiens (Human)
Description:
P29475
Residue:
1434
  
Inhibitor
Name:
BDBM50014716
Synonyms:
CHEMBL3262025 US9951014, Name 8S
Type:
Small organic molecule
Emp. Form.:
C22H28N6
Mol. Mass.:
376.4979
SMILES:
Cc1cc(N)nc(CCc2cncc(c2)[C@@H](CN)Cc2cc(C)cc(N)n2)c1
: