Target
Poly [ADP-ribose] polymerase 1
Ligand
BDBM27095
Substrate
BDBM27089
Meas. Tech.
In Vitro PARP Enzyme Assay
pH
8±n/a
Temperature
295.15±n/a K
Ki
30±n/a nM
Citation
 Penning, TDZhu, GDGandhi, VBGong, JLiu, XShi, YKlinghofer, VJohnson, EFDonawho, CKFrost, DJBontcheva-Diaz, VBouska, JJOsterling, DJOlson, AMMarsh, KCLuo, YGiranda, VL Discovery of the Poly(ADP-ribose) polymerase (PARP) inhibitor 2-[(R)-2-methylpyrrolidin-2-yl]-1H-benzimidazole-4-carboxamide (ABT-888) for the treatment of cancer. J Med Chem 52:514-23 (2009)  
Target
Name:
Poly [ADP-ribose] polymerase 1
Synonyms:
(ARTD1 or PARP1) 2.4.2.30 ADPRT ARTD1 Human diphtheria toxin-like ADP-ribosyltransferase (ARTD1 or PARP1) NT-PARP-1 PARP1 PPOL Poly [ADP-ribose] polymerase 1 (PARP) Poly [ADP-ribose] polymerase 1 (PARP1) Poly [ADP-ribose] polymerase 1, 28-kDa form Poly [ADP-ribose] polymerase 1, processed C-terminus Poly [ADP-ribose] polymerase-1 Poly(ADP-ribose) polymerase-1 (ARTD1/PARP1) Protein poly-ADP-ribosyltransferase PARP1 | Synonyms=ADPRT
Type:
Mol. Mass.:
113114.22
Organism:
Homo sapiens (Human)
Description:
P09874
Residue:
1014
  
Inhibitor
Name:
BDBM27095
Synonyms:
2-[(2S)-pyrrolidin-2-yl]-1H-1,3-benzodiazole-4-carboxamide cyclic amine-containing benzimidazole carboxamide, 6
Type:
Small organic molecule
Emp. Form.:
C12H14N4O
Mol. Mass.:
230.2658
SMILES:
NC(=O)c1cccc2nc([nH]c12)[C@@H]1CCCN1
:
Substrate
Name:
BDBM27089
Synonyms:
[3H] Nicotinamide adenine dinucleotide biotinylated NAD+
Type:
radiolabeled substrate
Emp. Form.:
C21H28N7O14P2
Mol. Mass.:
664.4325
SMILES:
NC(=O)c1ccc[n+](c1)[C@H]1O[C@@H](COP(O)(=O)OP(O)(=O)OC[C@H]2O[C@H]([C@H](O)[C@@H]2O)n2cnc3c(N)ncnc23)[C@H](O)[C@@H]1O
: