Target
Isocitrate dehydrogenase [NADP] cytoplasmic [R132H]
Ligand
BDBM389388
Substrate
Meas. Tech.
Biochemical Assay
IC50
20.0±n/a nM
Citation
 Rehwinkel, HSiebeneicher, HAnlauf, SNguyen, DPanknin, ORing, SSchwede, WBauser, MZimmermann, KKaulfuss, SNeuhaus, R Benzimidazol-2-amines as MIDH1 inhibitors US Patent  US9951027 Publication Date 4/24/2018 
Target
Name:
Isocitrate dehydrogenase [NADP] cytoplasmic [R132H]
Synonyms:
Cytosolic NADP-isocitrate dehydrogenase (IDH1)(R132H) IDH1 R132H IDHC_HUMAN Isocitrate dehydrogenase 1 mutant (R132H) Isocitrate dehydrogenase [NADP] cytoplasmic (IDH1)(R132H) PICD
Type:
Protein
Mol. Mass.:
46641.74
Organism:
Homo sapiens (Human)
Description:
Human IDH1 R132H (SEQ ID No. 2 in patent). First three are removed. Google patent parsed wrong.
Residue:
414
  
Inhibitor
Name:
BDBM389388
Synonyms:
US9951027, 2-155-1
Type:
Small organic molecule
Emp. Form.:
C27H35N3O3
Mol. Mass.:
449.5851
SMILES:
COc1cc2n([C@@H]3C[C@H](C)CC(C)(C)C3)c(Nc3ccc(cc3)C(C)C)nc2cc1C(O)=O
: