Target
Receptor-type tyrosine-protein kinase FLT3
Ligand
BDBM389578
Substrate
Meas. Tech.
Biochemical Activity Assay
IC50
1764±n/a nM
Citation
 Baska, FKéri, GOrfi, LBánhegyi, PKékesi, LZsákai, LSipos, ASzántai-kis, CDobos, JDen Blaauwen, T Styryl quinazoline derivatives as pharmaceutically active agents US Patent  US9951029 Publication Date 4/24/2018 
Target
Name:
Receptor-type tyrosine-protein kinase FLT3
Synonyms:
CD135 FL cytokine receptor FLK2 FLT3 Fetal liver kinase-2 Fms-like tyrosine kinase 3 (Flt-3) STK-1 Stem cell tyrosine kinase 1
Type:
Enzyme
Mol. Mass.:
112888.62
Organism:
Homo sapiens (Human)
Description:
P36888
Residue:
993
  
Inhibitor
Name:
BDBM389578
Synonyms:
N,N-diethyl-N'-(2-{(E)-2-[4- (methylthio)phenyl]vinyl}quinazolin- 4-yl)ethane-1,2-diamine | US9951029, 77
Type:
Small organic molecule
Emp. Form.:
C23H28N4S
Mol. Mass.:
392.56
SMILES:
CCN(CC)CCNc1nc(\C=C\c2ccc(SC)cc2)nc2ccccc12
: