Target
Histamine H3 receptor
Ligand
BDBM22914
Substrate
BDBM22530
Meas. Tech.
Radioligand Binding Assay
pH
7.4±n/a
Temperature
298.15±n/a K
Ki
72±9 nM
Citation
 Zhao, CSun, MBennani, YLGopalakrishnan, SMWitte, DGMiller, TRKrueger, KMBrowman, KEThiffault, CWetter, JMarsh, KCHancock, AAEsbenshade, TACowart, MD The alkaloid conessine and analogues as potent histamine H3 receptor antagonists. J Med Chem 51:5423-30 (2008)  
Target
Name:
Histamine H3 receptor
Synonyms:
G-protein coupled receptor 97 HH3R HRH3 Histamine H3 receptor (H3) Histamine receptor (H3 and H4)
Type:
G Protein-Coupled Receptor (GPCR)
Mol. Mass.:
48691.47
Organism:
Homo sapiens (Human)
Description:
Binding assays were using CHO cells stably expressing hH3R receptors.
Residue:
445
  
Inhibitor
Name:
BDBM22914
Synonyms:
CHEMBL260374 Thioperamide | US11622967, Compound Thioperamide
Type:
Small organic molecule
Emp. Form.:
C15H24N4S
Mol. Mass.:
292.443
SMILES:
S=C(NC1CCCCC1)N1CCC(CC1)c1cnc[nH]1
:
Substrate
Name:
BDBM22530
Synonyms:
N(alpha)-Methylhistamine N-methylhistamine [2-(1H-imidazol-5-yl)ethyl](methyl)amine | [3H]N-alpha-methyl histamine
Type:
radiolabeled ligand
Emp. Form.:
C6H11N3
Mol. Mass.:
125.1716
SMILES:
CNCCc1cnc[nH]1
: