Target
Histamine H2 receptor
Ligand
BDBM22914
Substrate
BDBM22568
Meas. Tech.
Radioligand Binding Assay
pH
7.4±n/a
Temperature
298.15±n/a K
Ki
>10000±n/a nM
Citation
 Zhao, CSun, MBennani, YLGopalakrishnan, SMWitte, DGMiller, TRKrueger, KMBrowman, KEThiffault, CWetter, JMarsh, KCHancock, AAEsbenshade, TACowart, MD The alkaloid conessine and analogues as potent histamine H3 receptor antagonists. J Med Chem 51:5423-30 (2008)  
Target
Name:
Histamine H2 receptor
Synonyms:
Gastric receptor I HISTAMINE H2 HRH2_HUMAN Histamine H2-Gs alpha S
Type:
G Protein-Coupled Receptor (GPCR)
Mol. Mass.:
40115.31
Organism:
Homo sapiens (Human)
Description:
Residue:
359
  
Inhibitor
Name:
BDBM22914
Synonyms:
CHEMBL260374 Thioperamide | US11622967, Compound Thioperamide
Type:
Small organic molecule
Emp. Form.:
C15H24N4S
Mol. Mass.:
292.443
SMILES:
S=C(NC1CCCCC1)N1CCC(CC1)c1cnc[nH]1
:
Substrate
Name:
BDBM22568
Synonyms:
1-cyano-3-{2-[({2-[(diaminomethylidene)amino]-1,3-thiazol-4-yl}methyl)sulfanyl]ethyl}-2-methylguanidine tiotidine
Type:
Small organic molecule
Emp. Form.:
C10H16N8S2
Mol. Mass.:
312.418
SMILES:
[#6]-[#7]-[#6](-[#7]C#N)=[#7]-[#6]-[#6]-[#16]-[#6]-c1csc(\[#7]=[#6](\[#7])-[#7])n1
: