Target
Cyclin-A2/Cyclin-dependent kinase 2
Ligand
BDBM27217
Substrate
Histone H1
Meas. Tech.
CDK Inhibition Assay
pH
7.5±n/a
Temperature
303.15±n/a K
IC50
40±n/a nM
Citation
 Popowycz, FFournet, GSchneider, CBettayeb, KFerandin, YLamigeon, CTirado, OMMateo-Lozano, SNotario, VColas, PBernard, PMeijer, LJoseph, B Pyrazolo[1,5-a]-1,3,5-triazine as a purine bioisostere: access to potent cyclin-dependent kinase inhibitor (R)-roscovitine analogue. J Med Chem 52:655-63 (2009)  
Target
Name:
Cyclin-A2/Cyclin-dependent kinase 2
Synonyms:
CDK2-CyclinA CDK2/Cyclin A Cyclin A2/dependent kinase 2 Cyclin-Dependent Kinase 2 (CDK2A)
Type:
Protein Complex
Mol. Mass.:
Description:
Cdk2/Cyclin A kinase was purified from insect cells coinfected with Cyclin A/Cdk2 baculovirus.
Components:
This complex has 2 components.
Component 1
Name:
Cyclin-dependent kinase 2
Synonyms:
CDK2 CDK2_HUMAN Cell division protein kinase 2 Protein cereblon/Cyclin-dependent kinase 2 | p33 protein kinase
Type:
Enzyme Subunit
Mol. Mass.:
33938.17
Organism:
Homo sapiens (Human)
Description:
P24941
Residue:
298
  
Component 2
Name:
Cyclin-A2
Synonyms:
CCN1 CCNA1 CCNA2_HUMAN Cyclin-A
Type:
Enzyme Subunit
Mol. Mass.:
48550.19
Organism:
Homo sapiens (Human)
Description:
P20248
Residue:
432
  
Inhibitor
Name:
BDBM27217
Synonyms:
(2R)-2-{[4-(benzylamino)-8-(propan-2-yl)pyrazolo[1,5-a][1,3,5]triazin-2-yl]amino}butan-1-ol pyrazolo[1,5-a]-1,3,5-triazine, 7a
Type:
Small organic molecule
Emp. Form.:
C19H26N6O
Mol. Mass.:
354.4493
SMILES:
CC[C@H](CO)Nc1nc(NCc2ccccc2)n2ncc(C(C)C)c2n1
:
Substrate
Name:
Histone H1
Synonyms:
Type:
Other Protein Type
Mol. Mass.:
358.43
Organism:
Bos taurus (bovine)
Description:
Residue:
3
NA