Target
Neutrophil collagenase
Ligand
BDBM50354624
Substrate
Meas. Tech.
Inhibition Assay
Ki
2600±400 nM
Citation
 Chang, MMobashery, S Selective matrix metalloproteinase inhibitors US Patent  US9951035 Publication Date 4/24/2018 
Target
Name:
Neutrophil collagenase
Synonyms:
CLG1 MMP8 Matrix metalloproteinase-8 PMNL collagenase | PMNL-CL
Type:
Enzyme
Mol. Mass.:
53413.48
Organism:
Homo sapiens (Human)
Description:
P22894
Residue:
467
  
Inhibitor
Name:
BDBM50354624
Synonyms:
CHEMBL1834422 US9951035, ND-322 (2)
Type:
Small organic molecule
Emp. Form.:
C15H15NO3S2
Mol. Mass.:
321.415
SMILES:
Nc1ccc(Oc2ccc(cc2)S(=O)(=O)CC2CS2)cc1
: