Target
Neutrophil collagenase
Ligand
BDBM50442356
Substrate
Meas. Tech.
Inhibition Assay
Ki
13000±2000 nM
Citation
 Chang, MMobashery, S Selective matrix metalloproteinase inhibitors US Patent  US9951035 Publication Date 4/24/2018 
Target
Name:
Neutrophil collagenase
Synonyms:
CLG1 MMP8 Matrix metalloproteinase-8 PMNL collagenase | PMNL-CL
Type:
Enzyme
Mol. Mass.:
53413.48
Organism:
Homo sapiens (Human)
Description:
P22894
Residue:
467
  
Inhibitor
Name:
BDBM50442356
Synonyms:
CHEMBL2442885 US9951035, ND-380
Type:
Small organic molecule
Emp. Form.:
C17H17NO5S2
Mol. Mass.:
379.451
SMILES:
COC(=O)Nc1ccc(Oc2ccc(cc2)S(=O)(=O)CC2CS2)cc1
: