Target
Glycogen synthase kinase-3 beta
Ligand
BDBM293590
Substrate
Meas. Tech.
Kinase Assay
EC50
>10000±n/a nM
Citation
 KC, SKMak, CCEastman, BWCao, JBollu, VMittapalli, GKChiruta, C Isoquinolin-3-yl carboxamides and preparation and use thereof US Patent  US9951048 Publication Date 4/24/2018 
Target
Name:
Glycogen synthase kinase-3 beta
Synonyms:
GSK-3 beta GSK3B Glycogen synthase kinase 3 beta (GSK3B) Glycogen synthase kinase-3 beta (GSK-3B) Glycogen synthase kinase-3 beta (GSK3B) Glycogen synthase kinase-3beta (GSK3B) | Serine/threonine-protein kinase GSK3B
Type:
Enzyme
Mol. Mass.:
46756.38
Organism:
Homo sapiens (Human)
Description:
P49841
Residue:
420
  
Inhibitor
Name:
BDBM293590
Synonyms:
US10106527, Compound 331 US11548872, Compound 331 US9951048, Compound 331
Type:
Small organic molecule
Emp. Form.:
C24H24N6OS
Mol. Mass.:
444.552
SMILES:
CN1CCN(CC1)c1cc(ccn1)C(=O)Nc1cc2cc(ccc2cn1)-c1ncc(C)s1
: