Target
Dual specificity tyrosine-phosphorylation-regulated kinase 1A
Ligand
BDBM293479
Substrate
Meas. Tech.
Kinase Assay
EC50
0.700±n/a nM
Citation
 KC, SKMak, CCEastman, BWCao, JBollu, VMittapalli, GKChiruta, C Isoquinolin-3-yl carboxamides and preparation and use thereof US Patent  US9951048 Publication Date 4/24/2018 
Target
Name:
Dual specificity tyrosine-phosphorylation-regulated kinase 1A
Synonyms:
DYR1A_HUMAN DYRK1A Dual specificity YAK1-related kinase 1A (Dyrk1A) Dual-specificity tyrosine-phosphorylation regulated kinase 1A HP86 MNBH
Type:
Enzyme
Mol. Mass.:
85616.61
Organism:
Homo sapiens (Human)
Description:
Q13627
Residue:
763
  
Inhibitor
Name:
BDBM293479
Synonyms:
US10106527, Compound 93 US11548872, Compound 93 US9951048, Compound 93
Type:
Small organic molecule
Emp. Form.:
C27H29N7O
Mol. Mass.:
467.5655
SMILES:
CN1CCC2(CN(C2)c2cc(ccn2)C(=O)Nc2cc3cc(ccc3cn2)-c2cnn(C)c2)CC1
: