Target
Tyrosine-protein kinase BTK
Ligand
BDBM389632
Substrate
Meas. Tech.
ADP-Glo Kinase Assay
IC50
<500±n/a nM
Citation
 Chen, XGao, YLiu, CNi, HMulvihill, M Substituted nicotinamide inhibitors of BTK and their preparation and use in the treatment of cancer, inflammation and autoimmune disease US Patent  US9951056 Publication Date 4/24/2018 
Target
Name:
Tyrosine-protein kinase BTK
Synonyms:
AGMX1 Agammaglobulinaemia tyrosine kinase B cell progenitor kinase BPK BTK_HUMAN Tyrosine Kinase BTK Tyrosine-protein kinase BTK (BTK)
Type:
Enzyme
Mol. Mass.:
76289.95
Organism:
Homo sapiens (Human)
Description:
Q06187
Residue:
659
  
Inhibitor
Name:
BDBM389632
Synonyms:
6-(4-acryloylpiperazin-1-yl)-2-(4-phenoxyphenyl)nicotinamide US11840513, Example 5 | US9951056, Example 5
Type:
Small organic molecule
Emp. Form.:
C25H24N4O3
Mol. Mass.:
428.4831
SMILES:
NC(=O)c1ccc(nc1-c1ccc(Oc2ccccc2)cc1)N1CCN(CC1)C(=O)C=C
: