Target
Tyrosine-protein kinase BTK
Ligand
BDBM389634
Substrate
Meas. Tech.
ADP-Glo Kinase Assay
IC50
<500±n/a nM
Citation
 Chen, XGao, YLiu, CNi, HMulvihill, M Substituted nicotinamide inhibitors of BTK and their preparation and use in the treatment of cancer, inflammation and autoimmune disease US Patent  US9951056 Publication Date 4/24/2018 
Target
Name:
Tyrosine-protein kinase BTK
Synonyms:
AGMX1 Agammaglobulinaemia tyrosine kinase B cell progenitor kinase BPK BTK_HUMAN Tyrosine Kinase BTK Tyrosine-protein kinase BTK (BTK)
Type:
Enzyme
Mol. Mass.:
76289.95
Organism:
Homo sapiens (Human)
Description:
Q06187
Residue:
659
  
Inhibitor
Name:
BDBM389634
Synonyms:
6-(4-acrylamidophenyl)-2-(4-phenoxyphenyl)nicotinamide US11840513, Example 7 | US9951056, Example 7
Type:
Small organic molecule
Emp. Form.:
C27H21N3O3
Mol. Mass.:
435.4739
SMILES:
NC(=O)c1ccc(nc1-c1ccc(Oc2ccccc2)cc1)-c1ccc(NC(=O)C=C)cc1
: