Target
Tyrosine-protein kinase BTK
Ligand
BDBM389656
Substrate
Meas. Tech.
ADP-Glo Kinase Assay
IC50
<500±n/a nM
Citation
 Chen, XGao, YLiu, CNi, HMulvihill, M Substituted nicotinamide inhibitors of BTK and their preparation and use in the treatment of cancer, inflammation and autoimmune disease US Patent  US9951056 Publication Date 4/24/2018 
Target
Name:
Tyrosine-protein kinase BTK
Synonyms:
AGMX1 Agammaglobulinaemia tyrosine kinase B cell progenitor kinase BPK BTK_HUMAN Tyrosine Kinase BTK Tyrosine-protein kinase BTK (BTK)
Type:
Enzyme
Mol. Mass.:
76289.95
Organism:
Homo sapiens (Human)
Description:
Q06187
Residue:
659
  
Inhibitor
Name:
BDBM389656
Synonyms:
1-(1-(4-(dimethylamino)but-2-enoyl)pyrrolidin-3-yl)-3-(4-phenoxyphenyl)-1H-pyrazole-4-carboxamide US9951056, Example 34
Type:
Small organic molecule
Emp. Form.:
C26H29N5O3
Mol. Mass.:
459.5402
SMILES:
CN(C)C\C=C\C(=O)N1CCC(C1)n1cc(C(N)=O)c(n1)-c1ccc(Oc2ccccc2)cc1
: