Target
C-X-C chemokine receptor type 3
Ligand
BDBM389684
Substrate
Meas. Tech.
FLIPR Assay
IC50
15.1±n/a nM
Citation
 Caroff, ECastro, RMeyer, EKimmerlin, T 8-(piperazin-1-yl)-1,2,3,4-tetrahydro-isoquinoline derivatives US Patent  US9951063 Publication Date 4/24/2018 
Target
Name:
C-X-C chemokine receptor type 3
Synonyms:
AAO92295.1 C-X-C chemokine receptor type 3 (CXCR3) CXCR3 CXCR3_HUMAN chemokine (C-X-C motif) receptor 3
Type:
Enzyme Catalytic Domain
Mol. Mass.:
40665.65
Organism:
Homo sapiens (Human)
Description:
Residue:
368
  
Inhibitor
Name:
BDBM389684
Synonyms:
US9951063, 3
Type:
Small organic molecule
Emp. Form.:
C27H33F3N6OS
Mol. Mass.:
546.651
SMILES:
CCc1csc(n1)N1CCc2c(C1)c(ccc2C(F)(F)F)N1CCN([C@H](C)C1)C(=O)Cn1nc(C)cc1C
: