Target
Membrane primary amine oxidase
Ligand
BDBM389915
Substrate
Meas. Tech.
Biological Assay
IC50
<50±n/a nM
Citation
 Espensen, MPatient, LEvans, DSimpson, ISavory, E Imidazo[4,5-C]pyridine and pyrrolo[2,3-C]pyridine derivatives as SSAO inhibitors US Patent  US9951068 Publication Date 4/24/2018 
Target
Name:
Membrane primary amine oxidase
Synonyms:
AOC3 Amine oxidase, copper containing Semicarbazide-sensitive amine oxidase/ Vascular adhesion protein 1 (SSAO/VAP-1) Vascular adhesion protein 1 (VAP-1)
Type:
Protein
Mol. Mass.:
84620.86
Organism:
Homo sapiens (Human)
Description:
Q16853
Residue:
763
  
Inhibitor
Name:
BDBM389915
Synonyms:
1-(4-{5-[3-(4-Fluorophenyl)-3H-imidazo[4,5-c]pyridin-2-yl]pyridin-2-yl}piperazin-1-yl)ethan-1-one US10968223, Compound 86 | US9951068, Compound 86
Type:
Small organic molecule
Emp. Form.:
C23H21FN6O
Mol. Mass.:
416.4508
SMILES:
CC(=O)N1CCN(CC1)c1ccc(cn1)-c1nc2ccncc2n1-c1ccc(F)cc1
: