Target
Membrane primary amine oxidase
Ligand
BDBM389967
Substrate
Meas. Tech.
Biological Assay
IC50
<50±n/a nM
Citation
 Espensen, MPatient, LEvans, DSimpson, ISavory, E Imidazo[4,5-C]pyridine and pyrrolo[2,3-C]pyridine derivatives as SSAO inhibitors US Patent  US9951068 Publication Date 4/24/2018 
Target
Name:
Membrane primary amine oxidase
Synonyms:
AOC3 Amine oxidase, copper containing Semicarbazide-sensitive amine oxidase/ Vascular adhesion protein 1 (SSAO/VAP-1) Vascular adhesion protein 1 (VAP-1)
Type:
Protein
Mol. Mass.:
84620.86
Organism:
Homo sapiens (Human)
Description:
Q16853
Residue:
763
  
Inhibitor
Name:
BDBM389967
Synonyms:
4-[1-(4-Chlorophenyl)-1H- pyrrolo[2,3-c]pyridin-2-yl]-1- cyclopropyl-1,2-dihydropyridin- 2-one US9951068, Compound 138
Type:
Small organic molecule
Emp. Form.:
C21H16ClN3O
Mol. Mass.:
361.824
SMILES:
Clc1ccc(cc1)-n1c(cc2ccncc12)-c1ccn(C2CC2)c(=O)c1
: