Target
Coagulation factor XI
Ligand
BDBM241389
Substrate
Meas. Tech.
Inhibition Assay
Ki
0.460±n/a nM
Citation
 Yang, WCorte, JRGilligan, PJPinto, DJEwing, WRDilger, AKWang, YFang, TPabbisetty, KBSmith, II, LM Dihydropyridone P1 as factor XIa inhibitors US Patent  US9951071 Publication Date 4/24/2018 
Target
Name:
Coagulation factor XI
Synonyms:
Coagulation factor XIa Coagulation factor XIa light chain FA11_HUMAN Factor XIa PTA | Plasma thromboplastin antecedent
Type:
Enzyme
Mol. Mass.:
70130.58
Organism:
Homo sapiens (Human)
Description:
P03951
Residue:
625
  
Inhibitor
Name:
BDBM241389
Synonyms:
US9409908, 21 | US9951071, Example 21
Type:
Small organic molecule
Emp. Form.:
C32H29ClF2N6O3
Mol. Mass.:
619.061
SMILES:
C[C@@H]1CCC[C@H](N2CCC(=CC2=O)c2c(F)ccc(Cl)c2F)c2cc(ccn2)-c2ccc(Nc3nnc(C)o3)cc2NC1=O
: