Target
Coagulation factor XI
Ligand
BDBM241529
Substrate
Meas. Tech.
Inhibition Assay
Ki
0.590±n/a nM
Citation
 Yang, WCorte, JRGilligan, PJPinto, DJEwing, WRDilger, AKWang, YFang, TPabbisetty, KBSmith, II, LM Dihydropyridone P1 as factor XIa inhibitors US Patent  US9951071 Publication Date 4/24/2018 
Target
Name:
Coagulation factor XI
Synonyms:
Coagulation factor XIa Coagulation factor XIa light chain FA11_HUMAN Factor XIa PTA | Plasma thromboplastin antecedent
Type:
Enzyme
Mol. Mass.:
70130.58
Organism:
Homo sapiens (Human)
Description:
P03951
Residue:
625
  
Inhibitor
Name:
BDBM241529
Synonyms:
US9409908, 161 | US9951071, Example 161
Type:
Small organic molecule
Emp. Form.:
C32H30BrClFN3O4
Mol. Mass.:
654.954
SMILES:
COC(=O)Nc1ccc-2c(NC(=O)[C@H](C)CCC[C@H](N3CCC(=CC3=O)c3c(F)c(Cl)ccc3Br)c3cccc-2c3)c1
: