Target
Cell division cycle 7-related protein kinase [58-574]/Protein DBF4 homolog A
Ligand
BDBM27427
Substrate
His6-tagged MCM2
Meas. Tech.
Radioactive Kinase Assay
pH
7.5±n/a
Temperature
310.15±n/a K
Ki
0.5±n/a nM
IC50
5±n/a nM
Citation
 Zhao, CTovar, CYin, XXu, QTodorov, ITVassilev, LTChen, L Synthesis and evaluation of pyrido-thieno-pyrimidines as potent and selective Cdc7 kinase inhibitors. Bioorg Med Chem Lett 19:319-23 (2009)  
Target
Name:
Cell division cycle 7-related protein kinase [58-574]/Protein DBF4 homolog A
Synonyms:
Cdc7 Kinase | Cdc7/DBF4
Type:
Protein Complex
Mol. Mass.:
Description:
Components:
This complex has 2 components.
Component 1
Name:
Cell division cycle 7-related protein kinase [58-574]
Synonyms:
CDC7 CDC7_HUMAN Cell division cycle 7-related protein kinase
Type:
Serine/threonine-protein kinase
Mol. Mass.:
57470.88
Organism:
Homo sapiens (Human)
Description:
O00311[58-574]
Residue:
517
  
Component 2
Name:
Protein DBF4 homolog A
Synonyms:
ASK Chiffon homolog A DBF4-type zinc finger-containing protein 1 DBF4A_HUMAN ZDBF1
Type:
Regulatory subunit
Mol. Mass.:
76869.65
Organism:
Homo sapiens (Human)
Description:
Residue:
674
  
Inhibitor
Name:
BDBM27427
Synonyms:
8-methyl-11-thia-9,14,16-triazatetracyclo[8.7.0.0^{2,7}.0^{12,17}]heptadeca-1,7,9,12(17),13,15-hexaen-13-amine | pyrido-thieno-pyrimidine, 6a
Type:
Small organic molecule
Emp. Form.:
C14H14N4S
Mol. Mass.:
270.353
SMILES:
Cc1nc2sc3c(N)ncnc3c2c2CCCCc12
:
Substrate
Name:
His6-tagged MCM2
Synonyms:
BM28 CDCL1 KIAA0030 MCM2_HUMAN Nuclear protein BM28
Type:
Other Protein Type
Mol. Mass.:
52558.30
Organism:
Homo sapiens (Human)
Description:
P49736[1-467]
Residue:
467