Target
Tyrosine-protein kinase BTK
Ligand
BDBM390008
Substrate
Meas. Tech.
Kinase Assay
IC50
505±n/a nM
Citation
 Liu, DZhang, MHu, Q Aminopyridazinone compounds as protein kinase inhibitors US Patent  US9951077 Publication Date 4/24/2018 
Target
Name:
Tyrosine-protein kinase BTK
Synonyms:
AGMX1 Agammaglobulinaemia tyrosine kinase B cell progenitor kinase BPK BTK_HUMAN Tyrosine Kinase BTK Tyrosine-protein kinase BTK (BTK)
Type:
Enzyme
Mol. Mass.:
76289.95
Organism:
Homo sapiens (Human)
Description:
Q06187
Residue:
659
  
Inhibitor
Name:
BDBM390008
Synonyms:
4-amino-1-[(3R)-1-[(E)-but-2- enoyl]-3-piperidyl]-3-(4- phenoxyphenyl)-6H-pyrrolo[2,3- d]pyridazin-7-one US9951077, 25
Type:
Small organic molecule
Emp. Form.:
C27H27N5O3
Mol. Mass.:
469.535
SMILES:
C\C=C\C(=O)N1CCC[C@H](C1)n1cc(-c2ccc(Oc3ccccc3)cc2)c2c(N)n[nH]c(=O)c12
: