Target
Tyrosine-protein kinase BTK
Ligand
BDBM390038
Substrate
Meas. Tech.
Kinase Assay
IC50
<10±n/a nM
Citation
 Liu, DZhang, MHu, Q Aminopyridazinone compounds as protein kinase inhibitors US Patent  US9951077 Publication Date 4/24/2018 
Target
Name:
Tyrosine-protein kinase BTK
Synonyms:
AGMX1 Agammaglobulinaemia tyrosine kinase B cell progenitor kinase BPK BTK_HUMAN Tyrosine Kinase BTK Tyrosine-protein kinase BTK (BTK)
Type:
Enzyme
Mol. Mass.:
76289.95
Organism:
Homo sapiens (Human)
Description:
Q06187
Residue:
659
  
Inhibitor
Name:
BDBM390038
Synonyms:
US10323037, Example 51 | US9951077, 51
Type:
Small organic molecule
Emp. Form.:
C21H23N5O3
Mol. Mass.:
393.439
SMILES:
COc1ccc(cc1)-c1cn(C2CCCN(C2)C(=O)C=C)c2c1c(N)n[nH]c2=O
: